Target
Lethal factor
Ligand
BDBM8512
Substrate
Peptide Substrate
Meas. Tech.
Fluorescence Resonance Energy Transfer Assay (FRET)
IC50
48±n/a nM
Citation
 Xiong, YWiltsie, JWoods, AGuo, JPivnichny, JVTang, WBansal, ACummings, RTCunningham, BRFriedlander, AMDouglas, CMSalowe, SPZaller, DMScolnick, EMSchmatz, DMBartizal, KHermes, JDMacCoss, MChapman, KT The discovery of a potent and selective lethal factor inhibitor for adjunct therapy of anthrax infection. Bioorg Med Chem Lett 16:964-8 (2006)  
Target
Name:
Lethal factor
Synonyms:
Anthrax Lethal Factor (LF) Antrax lethal toxin lef | lethal factor
Type:
PROTEIN
Mol. Mass.:
93758.56
Organism:
Bacillus anthracis
Description:
ChEMBL_1460338
Residue:
809
  
Inhibitor
Name:
BDBM8512
Synonyms:
(2R)-3-(2-aminiumylethoxy)-2-[(4-fluoro-3-methylbenzene)sulfonamido]-N-hydroxypropanamide | hydroxamate analogue 49
Type:
Small organic molecule
Emp. Form.:
C12H19FN3O5S
Mol. Mass.:
336.359
SMILES:
Cc1cc(ccc1F)S(=O)(=O)N[C@H](COCC[NH3+])C(=O)NO
:
Substrate
Name:
Peptide Substrate
Synonyms:
(Cou)Consensus(K(QSY-35)GG)-NH2
Type:
Peptide
Mol. Mass.:
9139.37
Organism:
Description:
Residue:
78