Target
Nicotinamide phosphoribosyltransferase
Ligand
BDBM306140
Substrate
Meas. Tech.
NAMPT Enzyme Assay
IC50
750±n/a nM
Citation
 Gigstad, KMCardin, DPHirayama, THirose, MHu, YKakei, HLee, HMMotoyaji, TNii, NShi, ZVyskocil, SWatanabe, H Quinoxaline compounds and uses thereof US Patent  US10144742 Publication Date 12/4/2018 
Target
Name:
Nicotinamide phosphoribosyltransferase
Synonyms:
NAMPT NAmPRTase Nicotinamide phosphoribosyltransferase (NAMPT) PBEF1 | Pre-B-cell colony-enhancing factor 1
Type:
Enzyme
Mol. Mass.:
55524.98
Organism:
Homo sapiens (Human)
Description:
P43490
Residue:
491
  
Inhibitor
Name:
BDBM306140
Synonyms:
US10144742, Compound I-302
Type:
Small organic molecule
Emp. Form.:
C30H21F2N5O
Mol. Mass.:
505.5174
SMILES:
Fc1ccc(cc1)-c1nc2ccc(cc2nc1-c1ccc(F)cc1)C(=O)NCCc1cnc2ccccn12
: