Target
Vasopressin V1b receptor
Ligand
BDBM175038
Substrate
Meas. Tech.
Binding Assay
pH
7.4±n/a
Temperature
298.15±n/a K
Ki
5.50±n/a nM
Comments
extracted
Citation
 Geneste, HHornberger, WJantos, KKling, AVan Gaalen, M Oxindole compounds carrying a nitrogen-bound spiro substituent and use thereof for treating vasopressin-related diseases US Patent  US9688678 Publication Date 6/27/2017 
Target
Name:
Vasopressin V1b receptor
Synonyms:
AVPR V1b AVPR1B Antidiuretic hormone receptor 1b V1bR VPR3 Vasopressin V1b receptor (V1b) Vasopressin V3 receptor
Type:
Enzyme
Mol. Mass.:
46985.01
Organism:
Homo sapiens (Human)
Description:
P47901
Residue:
424
  
Inhibitor
Name:
BDBM175038
Synonyms:
US9688678, 10 (+-)-3-(2-ethoxy-5-methoxy-phenyl)-1-[(5-methoxy-2-pyridyl)sulfonyl]-3-[2-[1-(oxetan-3-yl)-4-piperidyl]-2,6-diazaspiro[3.3]heptan-6-yl]-2-oxo-indoline-5-carbonitrile
Type:
Small organic molecule
Emp. Form.:
C37H44N6O7S
Mol. Mass.:
716.846
SMILES:
CCOc1ccc(OC)c(c1)C1(C2C=C(C=CC2N(C1=O)S(=O)(=O)c1ccc(OC)cn1)C#N)N1CC2(CN(C2)C2CCN(CC2)C2COC2)C1
: