Target
Vasopressin V1b receptor
Ligand
BDBM175067
Substrate
Meas. Tech.
Binding Assay
pH
7.4±n/a
Temperature
298.15±n/a K
Ki
5.50±n/a nM
Comments
extracted
Citation
 Geneste, HHornberger, WJantos, KKling, AVan Gaalen, M Oxindole compounds carrying a nitrogen-bound spiro substituent and use thereof for treating vasopressin-related diseases US Patent  US9688678 Publication Date 6/27/2017 
Target
Name:
Vasopressin V1b receptor
Synonyms:
AVPR V1b AVPR1B Antidiuretic hormone receptor 1b V1bR VPR3 Vasopressin V1b receptor (V1b) Vasopressin V3 receptor
Type:
Enzyme
Mol. Mass.:
46985.01
Organism:
Homo sapiens (Human)
Description:
P47901
Residue:
424
  
Inhibitor
Name:
BDBM175067
Synonyms:
US9688678, 28 (+-)-3-(2-ethoxy-5-methoxy-phenyl)-1-[(5-methoxy-2-pyridyl)sulfonyl]-3-[2-[4-(oxetan-3-yl)piperazin-1-yl]-6-azaspiro[3.3]heptan-6-yl]-2-oxo-indoline-5-carbonitrile
Type:
Small organic molecule
Emp. Form.:
C36H43N7O7S
Mol. Mass.:
717.834
SMILES:
CCOc1ccc(OC)cc1C1(C2C=C(C=CC2N(C1=O)S(=O)(=O)c1ccc(OC)cn1)C#N)N1CC2(CN(C2)N2CCN(CC2)C2COC2)C1
: