Target
Acetyl-CoA carboxylase 2
Ligand
BDBM306944
Substrate
Meas. Tech.
Inhibitory Activity on Human ACC1 and the ACC2
IC50
3.00±n/a nM
Citation
 Kobayashi, NAsahi, KTomida, YOhdan, MFumoto, MSasaki, YKurahashi, KInoue, TUrabe, TNishiura, YIwatsu, MMiyazaki, KOhyabu, NWada, TKatou, M Alkylene derivatives US Patent  US10150728 Publication Date 12/11/2018 
Target
Name:
Acetyl-CoA carboxylase 2
Synonyms:
ACACB ACC-beta ACCB Acetyl-CoA carboxylase 2 Acetyl-CoA carboxylase 2 (ACC2)
Type:
Protein
Mol. Mass.:
276535.21
Organism:
Homo sapiens (Human)
Description:
O00763
Residue:
2458
  
Inhibitor
Name:
BDBM306944
Synonyms:
US10150728, Example I-157
Type:
Small organic molecule
Emp. Form.:
C18H25N3O4S
Mol. Mass.:
379.474
SMILES:
CCOc1nc2ccc(OC[C@H]3C[C@@H](C3)OC[C@H](C)NC(C)=O)nc2s1
: