Target
Acetyl-CoA carboxylase 2
Ligand
BDBM307497
Substrate
Meas. Tech.
Inhibitory Activity on Human ACC1 and the ACC2
IC50
3.00±n/a nM
Citation
 Kobayashi, NAsahi, KTomida, YOhdan, MFumoto, MSasaki, YKurahashi, KInoue, TUrabe, TNishiura, YIwatsu, MMiyazaki, KOhyabu, NWada, TKatou, M Alkylene derivatives US Patent  US10150728 Publication Date 12/11/2018 
Target
Name:
Acetyl-CoA carboxylase 2
Synonyms:
ACACB ACC-beta ACCB Acetyl-CoA carboxylase 2 Acetyl-CoA carboxylase 2 (ACC2)
Type:
Protein
Mol. Mass.:
276535.21
Organism:
Homo sapiens (Human)
Description:
O00763
Residue:
2458
  
Inhibitor
Name:
BDBM307497
Synonyms:
US10150728, Example I-740
Type:
Small organic molecule
Emp. Form.:
C21H29ClFN3O4
Mol. Mass.:
441.924
SMILES:
CCOc1cc(F)c2nc(O[C@H]3CC[C@@H](CC3)OC[C@H](C)NC(C)=O)n(C)c2c1Cl
: