Target
Tyrosine-protein kinase receptor TYRO3
Ligand
BDBM308226
Substrate
Meas. Tech.
Activity Assay
IC50
4.40±n/a nM
Citation
 Wang, XZhang, WFrye, S Therapeutic uses of selected pyrimidine compounds with anti-Mer tyrosine kinase activity US Patent  US9649309 Publication Date 5/16/2017 
Target
Name:
Tyrosine-protein kinase receptor TYRO3
Synonyms:
BYK RSE TIF TYRO3_HUMAN | Tyrosine-protein kinase SKY
Type:
Protein
Mol. Mass.:
96894.13
Organism:
Homo sapiens (Human)
Description:
Q06418
Residue:
890
  
Inhibitor
Name:
BDBM308226
Synonyms:
US9649309, Compound UNC4103A
Type:
Small organic molecule
Emp. Form.:
C31H46N6O
Mol. Mass.:
518.7365
SMILES:
CCCCNc1ncc(c(N[C@H]2CC[C@H](O)CC2)n1)-c1ccc(CNCC23CC4CC(CC(C4)C2)C3)cn1
: