Target
Tyrosine-protein kinase receptor TYRO3
Ligand
BDBM308338
Substrate
Meas. Tech.
Activity Assay
IC50
7.90±n/a nM
Citation
 Wang, XZhang, WFrye, S Therapeutic uses of selected pyrimidine compounds with anti-Mer tyrosine kinase activity US Patent  US9649309 Publication Date 5/16/2017 
Target
Name:
Tyrosine-protein kinase receptor TYRO3
Synonyms:
BYK RSE TIF TYRO3_HUMAN | Tyrosine-protein kinase SKY
Type:
Protein
Mol. Mass.:
96894.13
Organism:
Homo sapiens (Human)
Description:
Q06418
Residue:
890
  
Inhibitor
Name:
BDBM308338
Synonyms:
US9649309, Compound UNC4247A
Type:
Small organic molecule
Emp. Form.:
C26H31FN6O
Mol. Mass.:
462.5623
SMILES:
O[C@H]1CC[C@@H](CC1)Nc1nc(Nc2cccc(F)c2)ncc1-c1ccc(CN2CCCC2)cn1
: