Target
Alpha-1,3-mannosyl-glycoprotein 2-beta-N-acetylglucosaminyltransferase
Ligand
BDBM308706
Substrate
Meas. Tech.
Radioligand Binding Assay
Ki
<10.00±n/a nM
Citation
 Amberg, WPohlki, FLange, UWang, YXZhao, HHLi, HBrewer, JTZanze, IDietrich, JVasudevan, ADjuric, SWLao, YHutchins, CW Pyrrolidine derivatives, pharmaceutical compositions containing them, and their use in therapy US Patent  US9656955 Publication Date 5/23/2017 
Target
Name:
Alpha-1,3-mannosyl-glycoprotein 2-beta-N-acetylglucosaminyltransferase
Synonyms:
GGNT1 GLYT1 GlcNAc-T I MGAT1 N-glycosyl-oligosaccharide-glycoprotein N-acetylglucosaminyltransferase I
Type:
PROTEIN
Mol. Mass.:
50891.32
Organism:
Homo sapiens (Human)
Description:
ChEMBL_107587
Residue:
445
  
Inhibitor
Name:
BDBM308706
Synonyms:
US9656955, Example 220 | trans-1-[(1-methyl-1H-imidazol-4-yl)sulfonyl]-4-phenyl-N-[3-(propan-2-yl)phenyl]pyrrolidin-3-amine
Type:
Small Organic Molecule
Emp. Form.:
C23H28N4O2S
Mol. Mass.:
424.559
SMILES:
CC(C)c1cccc(N[C@@H]2CN(C[C@H]2c2ccccc2)S(=O)(=O)c2cn(C)cn2)c1
: