Target
Alpha-1,3-mannosyl-glycoprotein 2-beta-N-acetylglucosaminyltransferase
Ligand
BDBM308712
Substrate
Meas. Tech.
Radioligand Binding Assay
Ki
<10.00±n/a nM
Citation
 Amberg, WPohlki, FLange, UWang, YXZhao, HHLi, HBrewer, JTZanze, IDietrich, JVasudevan, ADjuric, SWLao, YHutchins, CW Pyrrolidine derivatives, pharmaceutical compositions containing them, and their use in therapy US Patent  US9656955 Publication Date 5/23/2017 
Target
Name:
Alpha-1,3-mannosyl-glycoprotein 2-beta-N-acetylglucosaminyltransferase
Synonyms:
GGNT1 GLYT1 GlcNAc-T I MGAT1 N-glycosyl-oligosaccharide-glycoprotein N-acetylglucosaminyltransferase I
Type:
PROTEIN
Mol. Mass.:
50891.32
Organism:
Homo sapiens (Human)
Description:
ChEMBL_107587
Residue:
445
  
Inhibitor
Name:
BDBM308712
Synonyms:
US9656955, Example 226 | trans-1-[(1-methyl-1H-imidazol-4-yl)sulfonyl]-4-phenyl-N-[3-(trifluoromethoxy)phenyl]pyrrolidin-3-amine
Type:
Small Organic Molecule
Emp. Form.:
C21H21F3N4O3S
Mol. Mass.:
466.477
SMILES:
Cn1cnc(c1)S(=O)(=O)N1C[C@@H](Nc2cccc(OC(F)(F)F)c2)[C@@H](C1)c1ccccc1
: