Target
Alpha-1,3-mannosyl-glycoprotein 2-beta-N-acetylglucosaminyltransferase
Ligand
BDBM309159
Substrate
Meas. Tech.
Radioligand Binding Assay
Ki
<10.00±n/a nM
Citation
 Amberg, WPohlki, FLange, UWang, YXZhao, HHLi, HBrewer, JTZanze, IDietrich, JVasudevan, ADjuric, SWLao, YHutchins, CW Pyrrolidine derivatives, pharmaceutical compositions containing them, and their use in therapy US Patent  US9656955 Publication Date 5/23/2017 
Target
Name:
Alpha-1,3-mannosyl-glycoprotein 2-beta-N-acetylglucosaminyltransferase
Synonyms:
GGNT1 GLYT1 GlcNAc-T I MGAT1 N-glycosyl-oligosaccharide-glycoprotein N-acetylglucosaminyltransferase I
Type:
PROTEIN
Mol. Mass.:
50891.32
Organism:
Homo sapiens (Human)
Description:
ChEMBL_107587
Residue:
445
  
Inhibitor
Name:
BDBM309159
Synonyms:
Trans-1-[(1-methyl-1H-imidazol-4-yl)sulfonyl]-4-(tetrahydro-2H-pyran-2-yl)-N-[3-(trifluoromethyl)phenyl]pyrrolidin-3-amine | US9656955, Example 681
Type:
Small Organic Molecule
Emp. Form.:
C20H25F3N4O3S
Mol. Mass.:
458.498
SMILES:
Cn1cnc(c1)S(=O)(=O)N1C[C@@H](Nc2cccc(c2)C(F)(F)F)[C@@H](C1)C1CCCCO1
: