Target
Mu-type opioid receptor
Ligand
BDBM309410
Substrate
Meas. Tech.
Opioid Receptor Binding Assay
EC50
0.190±n/a nM
Citation
 Blumberg, LCDeaver, DREyerman, DJWynn, TA Methods for treating depressive symptoms US Patent  US9656961 Publication Date 5/23/2017 
Target
Name:
Mu-type opioid receptor
Synonyms:
M-OR-1 MOR-1 MUOR1 Mu opiate receptor OPRM1 hMOP | mu-type opioid receptor isoform MOR-1
Type:
G Protein-Coupled Receptor (GPCR)
Mol. Mass.:
44789.51
Organism:
Homo sapiens (Human)
Description:
P35372
Residue:
400
  
Inhibitor
Name:
BDBM309410
Synonyms:
US10231963, Table B.13 US9656961, Example 00130
Type:
Small organic molecule
Emp. Form.:
C28H31NO4
Mol. Mass.:
445.55
SMILES:
Oc1ccc2C[C@H]3N(CC=C)CC[C@@]45[C@@H](Oc1c24)C(=O)CC[C@@]35OCCCc1ccccc1
: