Target
Glutaminyl-peptide cyclotransferase
Ligand
BDBM309891
Substrate
Meas. Tech.
Spectrophotometric Assay
Ki
24.0±n/a nM
Citation
 Buchholz, MHeiser, UNiestroj, AJSommer, R Inhibitors of glutaminyl cyclase US Patent  US9656991 Publication Date 5/23/2017 
Target
Name:
Glutaminyl-peptide cyclotransferase
Synonyms:
Glutaminyl Cyclase Glutaminyl-peptide cyclotransferase Glutaminyl-tRNA cyclotransferase QPCT | QPCT_HUMAN
Type:
Enzyme
Mol. Mass.:
40877.05
Organism:
Homo sapiens (Human)
Description:
Q16769
Residue:
361
  
Inhibitor
Name:
BDBM309891
Synonyms:
1-(3,5- dimethoxyphenyl)-3- (3-(5-methyl-1H- imidazol-1- yl)propyl)thiourea | US9656991, 5
Type:
Small organic molecule
Emp. Form.:
C16H22N4O2S
Mol. Mass.:
334.436
SMILES:
COc1cc(NC(=S)NCCCn2cncc2C)cc(OC)c1
: