Target
Glutaminyl-peptide cyclotransferase
Ligand
BDBM309921
Substrate
Meas. Tech.
Spectrophotometric Assay
Ki
272±n/a nM
Citation
 Buchholz, MHeiser, UNiestroj, AJSommer, R Inhibitors of glutaminyl cyclase US Patent  US9656991 Publication Date 5/23/2017 
Target
Name:
Glutaminyl-peptide cyclotransferase
Synonyms:
Glutaminyl Cyclase Glutaminyl-peptide cyclotransferase Glutaminyl-tRNA cyclotransferase QPCT | QPCT_HUMAN
Type:
Enzyme
Mol. Mass.:
40877.05
Organism:
Homo sapiens (Human)
Description:
Q16769
Residue:
361
  
Inhibitor
Name:
BDBM309921
Synonyms:
1-(4- (benzyloxy)phenyl)- 3-(3-(4-methyl-1H- imidazol-1- yl)propyl)thiourea | US9656991, 35
Type:
Small organic molecule
Emp. Form.:
C21H24N4OS
Mol. Mass.:
380.506
SMILES:
Cc1cn(CCCNC(=S)Nc2ccc(OCc3ccccc3)cc2)cn1
: