Target
Glutaminyl-peptide cyclotransferase
Ligand
BDBM309942
Substrate
Meas. Tech.
Spectrophotometric Assay
Ki
108±n/a nM
Citation
 Buchholz, MHeiser, UNiestroj, AJSommer, R Inhibitors of glutaminyl cyclase US Patent  US9656991 Publication Date 5/23/2017 
Target
Name:
Glutaminyl-peptide cyclotransferase
Synonyms:
Glutaminyl Cyclase Glutaminyl-peptide cyclotransferase Glutaminyl-tRNA cyclotransferase QPCT | QPCT_HUMAN
Type:
Enzyme
Mol. Mass.:
40877.05
Organism:
Homo sapiens (Human)
Description:
Q16769
Residue:
361
  
Inhibitor
Name:
BDBM309942
Synonyms:
1-(2,4- dimethoxybenzyl)-3- (1H- benzo[d]imidazol-5- yl)thiourea | US9656991, 56
Type:
Small organic molecule
Emp. Form.:
C17H18N4O2S
Mol. Mass.:
342.415
SMILES:
COc1ccc(CNC(=S)Nc2ccc3[nH]cnc3c2)c(OC)c1
: