Target
Acetylcholinesterase
Ligand
BDBM8986
Substrate
BDBM8959
Meas. Tech.
AChE Inhibition Assay
pH
8±n/a
Temperature
310.15±n/a K
IC50
550±20 nM
Citation
 Recanatini, MCavalli, ABelluti, FPiazzi, LRampa, ABisi, AGobbi, SValenti, PAndrisano, VBartolini, MCavrini, V SAR of 9-amino-1,2,3,4-tetrahydroacridine-based acetylcholinesterase inhibitors: synthesis, enzyme inhibitory activity, QSAR, and structure-based CoMFA of tacrine analogues. J Med Chem 43:2007-18 (2000)  
Target
Name:
Acetylcholinesterase
Synonyms:
ACES_HUMAN Acetylcholinesterase (AChE) | Acetylcholinesterase (human AChE)
Type:
Enzyme
Mol. Mass.:
67792.70
Organism:
Homo sapiens (Human)
Description:
P22303
Residue:
614
  
Inhibitor
Name:
BDBM8986
Synonyms:
7-chloro-1,2,3,4-tetrahydroacridin-9-amine | Tacrine Analogue 3
Type:
Small organic molecule
Emp. Form.:
C13H13ClN2
Mol. Mass.:
232.709
SMILES:
Nc1c2CCCCc2nc2ccc(Cl)cc12
:
Substrate
Name:
BDBM8959
Synonyms:
(2-Mercaptoethyl)trimethylammonium iodide acetate Acetylthiocholine acetylthiocholine chloride | acetylthiocholine iodide
Type:
Small organic molecule
Emp. Form.:
C7H16NOS
Mol. Mass.:
162.272
SMILES:
CC(=O)SCC[N+](C)(C)C
: