Target
Acetylcholinesterase
Ligand
BDBM9043
Substrate
BDBM8959
Meas. Tech.
In Vitro Enzyme Inhibition Assay
pH
8±n/a
Temperature
303.15±n/a K
IC50
3.0±n/a nM
Citation
 Munoz-Ruiz, PRubio, LGarcia-Palomero, EDorronsoro, Idel Monte-Millan, MValenzuela, RUsan, Pde Austria, CBartolini, MAndrisano, VBidon-Chanal, AOrozco, MLuque, FJMedina, MMartinez, A Design, synthesis, and biological evaluation of dual binding site acetylcholinesterase inhibitors: new disease-modifying agents for Alzheimer's disease. J Med Chem 48:7223-33 (2005)  
Target
Name:
Acetylcholinesterase
Synonyms:
ACES_BOVIN Acetylcholinesterase (AChE) | Acetylcholinesterase precursor
Type:
Enzyme
Mol. Mass.:
67659.62
Organism:
Bos taurus (bovine)
Description:
Residue:
613
  
Inhibitor
Name:
BDBM9043
Synonyms:
2-(1H-indol-3-yl)ethyl N-{7-[(6-chloro-1,2,3,4-tetrahydroacridin-9-yl)amino]heptyl}carbamate [7-(6-Chloro-1,2,3,4-tetrahydroacridin-9-ylamino)-heptyl]carbamic Acid 2-(1H-Indol-3-yl)ethyl Ester
Type:
Small organic molecule
Emp. Form.:
C31H37ClN4O2
Mol. Mass.:
533.104
SMILES:
Clc1ccc2c(NCCCCCCCNC(=O)OCCc3c[nH]c4ccccc34)c3CCCCc3nc2c1
:
Substrate
Name:
BDBM8959
Synonyms:
(2-Mercaptoethyl)trimethylammonium iodide acetate Acetylthiocholine acetylthiocholine chloride | acetylthiocholine iodide
Type:
Small organic molecule
Emp. Form.:
C7H16NOS
Mol. Mass.:
162.272
SMILES:
CC(=O)SCC[N+](C)(C)C
: