Target
Acetylcholinesterase
Ligand
BDBM9055
Substrate
BDBM8959
Meas. Tech.
Enzyme Inhibition Assay
pH
7.4±n/a
Temperature
310.15±n/a K
IC50
0.3±0.2 nM
Citation
 Hu, MKWu, LJHsiao, GYen, MH Homodimeric tacrine congeners as acetylcholinesterase inhibitors. J Med Chem 45:2277-82 (2002)  
Target
Name:
Acetylcholinesterase
Synonyms:
ACES_RAT Acetylcholinesterase and butyrylcholinesterase (AChE and BChE) Acetylcholinesterase, AChE | Ache
Type:
Enzyme
Mol. Mass.:
68193.62
Organism:
Rattus norvegicus (rat)
Description:
P37136
Residue:
614
  
Inhibitor
Name:
BDBM9055
Synonyms:
6-chloro-N-{8-[(6-chloro-1,2,3,4-tetrahydroacridin-9-yl)amino]octyl}-1,2,3,4-tetrahydroacridin-9-amine Octylene-Linked Bis-(6-chloro)tacrine
Type:
Small organic molecule
Emp. Form.:
C34H40Cl2N4
Mol. Mass.:
575.614
SMILES:
Clc1ccc2c(NCCCCCCCCNc3c4CCCCc4nc4cc(Cl)ccc34)c3CCCCc3nc2c1
:
Substrate
Name:
BDBM8959
Synonyms:
(2-Mercaptoethyl)trimethylammonium iodide acetate Acetylthiocholine acetylthiocholine chloride | acetylthiocholine iodide
Type:
Small organic molecule
Emp. Form.:
C7H16NOS
Mol. Mass.:
162.272
SMILES:
CC(=O)SCC[N+](C)(C)C
: