Target
Acetylcholinesterase
Ligand
BDBM9056
Substrate
BDBM8959
Meas. Tech.
Enzyme Inhibition Assay
pH
7.4±n/a
Temperature
310.15±n/a K
IC50
4.8±1.3 nM
Citation
 Hu, MKWu, LJHsiao, GYen, MH Homodimeric tacrine congeners as acetylcholinesterase inhibitors. J Med Chem 45:2277-82 (2002)  
Target
Name:
Acetylcholinesterase
Synonyms:
ACES_RAT Acetylcholinesterase and butyrylcholinesterase (AChE and BChE) Acetylcholinesterase, AChE | Ache
Type:
Enzyme
Mol. Mass.:
68193.62
Organism:
Rattus norvegicus (rat)
Description:
P37136
Residue:
614
  
Inhibitor
Name:
BDBM9056
Synonyms:
Homodimeric Tacrine Analog 3j N-(6-{6H,7H,8H,9H-cyclohexa[b]1,8-naphthyridin-5-ylamino}hexyl)-6H,7H,8H,9H-cyclohexa[b]1,8-naphthyridin-5-amine
Type:
Small organic molecule
Emp. Form.:
C30H36N6
Mol. Mass.:
480.647
SMILES:
C(CCCNc1c2CCCCc2nc2ncccc12)CCNc1c2CCCCc2nc2ncccc12
:
Substrate
Name:
BDBM8959
Synonyms:
(2-Mercaptoethyl)trimethylammonium iodide acetate Acetylthiocholine acetylthiocholine chloride | acetylthiocholine iodide
Type:
Small organic molecule
Emp. Form.:
C7H16NOS
Mol. Mass.:
162.272
SMILES:
CC(=O)SCC[N+](C)(C)C
: