Target
Cholinesterase
Ligand
BDBM9058
Substrate
BDBM8978
Meas. Tech.
Enzyme Inhibition Assay
IC50
23±n/a nM
Citation
 Hu, MKWu, LJHsiao, GYen, MH Homodimeric tacrine congeners as acetylcholinesterase inhibitors. J Med Chem 45:2277-82 (2002)  
Target
Name:
Cholinesterase
Synonyms:
Acylcholine acylhydrolase Butyrylcholine esterase (BChE) Butyrylcholinesterase (BuChE) CHLE_HUMAN Cholinesterases Pseudocholinesterase
Type:
Homotetramer
Mol. Mass.:
68422.27
Organism:
Homo sapiens (Human)
Description:
P06276
Residue:
602
  
Inhibitor
Name:
BDBM9058
Synonyms:
Homodimeric Tacrine Analog 3m N-(8-{6H,7H,8H,9H-cyclohexa[b]1,8-naphthyridin-5-ylamino}octyl)-6H,7H,8H,9H-cyclohexa[b]1,8-naphthyridin-5-amine
Type:
Small organic molecule
Emp. Form.:
C32H40N6
Mol. Mass.:
508.7002
SMILES:
C(CCCCNc1c2CCCCc2nc2ncccc12)CCCNc1c2CCCCc2nc2ncccc12
:
Substrate
Name:
BDBM8978
Synonyms:
(Propylcarbonylthioethyl)trimethylammonium iodide CHEMBL148530 butyrylthiocholine | butyrylthiocholine chloride
Type:
Small organic molecule
Emp. Form.:
C9H20NOS
Mol. Mass.:
190.326
SMILES:
CCCC(=O)SCC[N+](C)(C)C
: