Target
Cholinesterase
Ligand
BDBM9065
Substrate
BDBM8978
Meas. Tech.
Cholinesterase Inhibition Assay
IC50
220±n/a nM
Citation
 Alonso, DDorronsoro, IRubio, LMunoz, PGarcia-Palomero, EDel Monte, MBidon-Chanal, AOrozco, MLuque, FJCastro, AMedina, MMartinez, A Donepezil-tacrine hybrid related derivatives as new dual binding site inhibitors of AChE. Bioorg Med Chem 13:6588-97 (2005)  
Target
Name:
Cholinesterase
Synonyms:
Acylcholine acylhydrolase Butyrylcholine esterase (BChE) Butyrylcholinesterase (BuChE) CHLE_HUMAN Cholinesterases Pseudocholinesterase
Type:
Homotetramer
Mol. Mass.:
68422.27
Organism:
Homo sapiens (Human)
Description:
P06276
Residue:
602
  
Inhibitor
Name:
BDBM9065
Synonyms:
Donepezil-tacrine hybrid 10 N-{6-[(6-chloro-1,2,3,4-tetrahydroacridin-9-yl)amino]hexyl}-2-(1,3-dioxo-2,3-dihydro-1H-isoindol-2-yl)acetamide
Type:
Small organic molecule
Emp. Form.:
C29H31ClN4O3
Mol. Mass.:
519.034
SMILES:
Clc1ccc2c(NCCCCCCNC(=O)CN3C(=O)c4ccccc4C3=O)c3CCCCc3nc2c1
:
Substrate
Name:
BDBM8978
Synonyms:
(Propylcarbonylthioethyl)trimethylammonium iodide CHEMBL148530 butyrylthiocholine | butyrylthiocholine chloride
Type:
Small organic molecule
Emp. Form.:
C9H20NOS
Mol. Mass.:
190.326
SMILES:
CCCC(=O)SCC[N+](C)(C)C
: