Target
Cholinesterase
Ligand
BDBM9071
Substrate
BDBM8978
Meas. Tech.
Cholinesterase Inhibition Assay
IC50
711±n/a nM
Citation
 Alonso, DDorronsoro, IRubio, LMunoz, PGarcia-Palomero, EDel Monte, MBidon-Chanal, AOrozco, MLuque, FJCastro, AMedina, MMartinez, A Donepezil-tacrine hybrid related derivatives as new dual binding site inhibitors of AChE. Bioorg Med Chem 13:6588-97 (2005)  
Target
Name:
Cholinesterase
Synonyms:
Acylcholine acylhydrolase Butyrylcholine esterase (BChE) Butyrylcholinesterase (BuChE) CHLE_HUMAN Cholinesterases Pseudocholinesterase
Type:
Homotetramer
Mol. Mass.:
68422.27
Organism:
Homo sapiens (Human)
Description:
P06276
Residue:
602
  
Inhibitor
Name:
BDBM9071
Synonyms:
2-[7-(Acridin-9-ylamino)-heptyl]-isoindole-1,3-dione Donepezil-tacrine hybrid 20
Type:
Small organic molecule
Emp. Form.:
C28H27N3O2
Mol. Mass.:
437.5329
SMILES:
O=C1N(CCCCCCCNc2c3ccccc3nc3ccccc23)C(=O)c2ccccc12
:
Substrate
Name:
BDBM8978
Synonyms:
(Propylcarbonylthioethyl)trimethylammonium iodide CHEMBL148530 butyrylthiocholine | butyrylthiocholine chloride
Type:
Small organic molecule
Emp. Form.:
C9H20NOS
Mol. Mass.:
190.326
SMILES:
CCCC(=O)SCC[N+](C)(C)C
: