Target
Histone-lysine N-methyltransferase EZH2 [Y641F]
Ligand
BDBM310763
Substrate
Meas. Tech.
Wild-Type PRC2 Enzyme Assay
IC50
>50000±n/a nM
Citation
 Campbell, JE Substituted benzene compounds US Patent  US10150764 Publication Date 12/11/2018 
Target
Name:
Histone-lysine N-methyltransferase EZH2 [Y641F]
Synonyms:
EZH2 EZH2_HUMAN KMT6
Type:
Mol. Mass.:
85351.84
Organism:
Homo sapiens (Human)
Description:
Q15910[Y641F]
Residue:
746
  
Inhibitor
Name:
BDBM310763
Synonyms:
US10150764, Compound 48
Type:
Small organic molecule
Emp. Form.:
C28H39ClN6O2
Mol. Mass.:
527.101
SMILES:
CCN([C@H]1CC[C@@H](CC1)N(C)C)c1cc(Cl)cc(C(=O)NCc2c(OC)nn3c(C)cc(C)nc23)c1C
: