Target
Dimer of Gag-Pol polyprotein [501-599,Q508K,L534I,L564I,C568A,C596A]
Ligand
BDBM9225
Substrate
HIV Protease substrate
Meas. Tech.
Protease Inhibition Assay
pH
6.4±n/a
Temperature
298.15±n/a K
Ki
>0.5±n/a nM
Citation
 Spaltenstein, AAlmond, MRBock, WJCleary, DGFurfine, ESHazen, RJKazmierski, WMSalituro, FGTung, RDWright, LL Novel inhibitors of HIV protease: design, synthesis and biological evaluation of picomolar inhibitors containing cyclic P1/P2 scaffolds. Bioorg Med Chem Lett 10:1159-62 (2000)  
Target
Name:
Dimer of Gag-Pol polyprotein [501-599,Q508K,L534I,L564I,C568A,C596A]
Synonyms:
HIV-1 Protease
Type:
Protein Complex
Mol. Mass.:
Description:
Components:
This complex has 2 components.
Component 1
Name:
Gag-Pol polyprotein [501-599,Q508K,L534I,L564I,C568A,C596A]
Synonyms:
HIV-1 Protease chain A gag-pol
Type:
Enzyme Subunit
Mol. Mass.:
10732.11
Organism:
Human immunodeficiency virus type 1
Description:
The HIV-1 protease (Genbank HIVHXB2CG) clone was constructed with the substitutions Q7K, L33I, and L63I, to minimize the autoproteolysis of the protease, and C67A and C95A, to prevent cysteine-thiol oxidation.
Residue:
99
  
Component 2
Name:
Gag-Pol polyprotein [501-599,Q508K,L534I,L564I,C568A,C596A]
Synonyms:
HIV-1 Protease chain A gag-pol
Type:
Enzyme Subunit
Mol. Mass.:
10732.11
Organism:
Human immunodeficiency virus type 1
Description:
The HIV-1 protease (Genbank HIVHXB2CG) clone was constructed with the substitutions Q7K, L33I, and L63I, to minimize the autoproteolysis of the protease, and C67A and C95A, to prevent cysteine-thiol oxidation.
Residue:
99
  
Inhibitor
Name:
BDBM9225
Synonyms:
(2R,4S)-2-benzyl-5-[(3R,5R)-3,5-dibenzyl-2-oxopyrrolidin-1-yl]-4-hydroxy-N-[(1S,2R)-2-hydroxy-2,3-dihydro-1H-inden-1-yl]pentanamide | pyrrolidinone scaffold 8c
Type:
Small organic molecule
Emp. Form.:
C39H42N2O4
Mol. Mass.:
602.7618
SMILES:
[H][C@@]1(Cc2ccccc2)C[C@H](Cc2ccccc2)N(C[C@@H](O)C[C@@H](Cc2ccccc2)C(=O)N[C@@H]2[C@H](O)Cc3ccccc23)C1=O
:
Substrate
Name:
HIV Protease substrate
Synonyms:
Fluorogenic Peptide Substrate
Type:
Peptide
Mol. Mass.:
3467.28
Organism:
Description:
Residue:
30