Target
Dimer of Gag-Pol polyprotein [501-599,Q508K,L534I,L564I,C568A,C596A]
Ligand
BDBM9236
Substrate
HIV Protease substrate
Meas. Tech.
Protease Inhibition Assay
pH
6.4±n/a
Temperature
298.15±n/a K
Ki
0.015±n/a nM
Citation
 Ghosh, AKSwanson, LMLiu, CHussain, KACho, HWalters, DEHolland, LButhod, J Novel cyclourethane-derived HIV protease inhibitors: a ring-closing olefin metathesis based strategy. Bioorg Med Chem Lett 12:1993-6 (2002)  
Target
Name:
Dimer of Gag-Pol polyprotein [501-599,Q508K,L534I,L564I,C568A,C596A]
Synonyms:
HIV-1 Protease
Type:
Protein Complex
Mol. Mass.:
Description:
Components:
This complex has 2 components.
Component 1
Name:
Gag-Pol polyprotein [501-599,Q508K,L534I,L564I,C568A,C596A]
Synonyms:
HIV-1 Protease chain A gag-pol
Type:
Enzyme Subunit
Mol. Mass.:
10732.11
Organism:
Human immunodeficiency virus type 1
Description:
The HIV-1 protease (Genbank HIVHXB2CG) clone was constructed with the substitutions Q7K, L33I, and L63I, to minimize the autoproteolysis of the protease, and C67A and C95A, to prevent cysteine-thiol oxidation.
Residue:
99
  
Component 2
Name:
Gag-Pol polyprotein [501-599,Q508K,L534I,L564I,C568A,C596A]
Synonyms:
HIV-1 Protease chain A gag-pol
Type:
Enzyme Subunit
Mol. Mass.:
10732.11
Organism:
Human immunodeficiency virus type 1
Description:
The HIV-1 protease (Genbank HIVHXB2CG) clone was constructed with the substitutions Q7K, L33I, and L63I, to minimize the autoproteolysis of the protease, and C67A and C95A, to prevent cysteine-thiol oxidation.
Residue:
99
  
Inhibitor
Name:
BDBM9236
Synonyms:
(3R,3aS,6aR)-hexahydrofuro[2,3-b]furan-3-yl N-[(2S,3R)-3-hydroxy-4-[(4-methoxybenzene)(2-methylpropyl)sulfonamido]-1-phenylbutan-2-yl]carbamate UIC-94003
Type:
Small organic molecule
Emp. Form.:
C28H38N2O8S
Mol. Mass.:
562.675
SMILES:
[H][C@@]1(CO[C@@]2([H])OCC[C@@]12[H])OC(=O)N[C@@H](Cc1ccccc1)[C@H](O)CN(CC(C)C)S(=O)(=O)c1ccc(OC)cc1
:
Substrate
Name:
HIV Protease substrate
Synonyms:
Fluorogenic Peptide Substrate
Type:
Peptide
Mol. Mass.:
3467.28
Organism:
Description:
Residue:
30