Target
Dimer of Gag-Pol polyprotein [489-587]
Ligand
BDBM9299
Substrate
HIV Protease Peptide Substrate
Meas. Tech.
Protease Inhibition Assay
pH
5.5±n/a
Temperature
303.15±n/a K
IC50
67.9±n/a nM
Citation
 Ghosh, AKThompson, WJHolloway, MKMcKee, SPDuong, TTLee, HYMunson, PMSmith, AMWai, JMDarke, PL Potent HIV protease inhibitors: the development of tetrahydrofuranylglycines as novel P2-ligands and pyrazine amides as P3-ligands. J Med Chem 36:2300-10 (1993)  
Target
Name:
Dimer of Gag-Pol polyprotein [489-587]
Synonyms:
HIV-1 Protease
Type:
Protein Complex
Mol. Mass.:
Description:
Components:
This complex has 2 components.
Component 1
Name:
Gag-Pol polyprotein [489-587]
Synonyms:
HIV protease HIV-1 Protease chain A POL_HV1N5 | gag-pol
Type:
Enzyme Subunit
Mol. Mass.:
10822.21
Organism:
Human immunodeficiency virus type 1
Description:
P12497[489-587]
Residue:
99
  
Component 2
Name:
Gag-Pol polyprotein [489-587]
Synonyms:
HIV protease HIV-1 Protease chain A POL_HV1N5 | gag-pol
Type:
Enzyme Subunit
Mol. Mass.:
10822.21
Organism:
Human immunodeficiency virus type 1
Description:
P12497[489-587]
Residue:
99
  
Inhibitor
Name:
BDBM9299
Synonyms:
(3S,4aS,8aS)-N-tert-butyl-2-[(2R,3S)-2-hydroxy-3-[(2S)-2-(oxan-4-yl)-2-(quinolin-2-ylformamido)acetamido]-4-phenylbutyl]-decahydroisoquinoline-3-carboxamide | Ro 31-8959 (Saquinavir) analog 35
Type:
Small organic molecule
Emp. Form.:
C41H55N5O5
Mol. Mass.:
697.9059
SMILES:
CC(C)(C)NC(=O)[C@@H]1C[C@@H]2CCCC[C@@H]2CN1C[C@@H](O)[C@H](Cc1ccccc1)NC(=O)[C@@H](NC(=O)c1ccc2ccccc2n1)C1CCOCC1
:
Substrate
Name:
HIV Protease Peptide Substrate
Synonyms:
HIV Protease Substrate
Type:
Peptide
Mol. Mass.:
2715.95
Organism:
Description:
Residue:
25