Target
Isoform 2 of MAP kinase-interacting serine/threonine-protein kinase 1 (MNK1a) 344D]
Ligand
BDBM176783
Substrate
Meas. Tech.
MKNK1 Kinase High ATP Assay
pH
7.5±n/a
IC50
85±n/a nM
Comments
extracted
Citation
 Klar, UWortmann, LGraham, KPuehler, FSülzle, DKettschau, GLienau, P Substituted thiazolopyrimidines US Patent  US9675612 Publication Date 6/13/2017 
Target
Name:
Isoform 2 of MAP kinase-interacting serine/threonine-protein kinase 1 (MNK1a) 344D]
Synonyms:
Isoform 2 of MAP kinase-interacting serine/threonine-protein kinase 1 (MNK1a) 344D] MAP kinase signal-integrating kinase 1 (MNK1) (T344D) MAP kinase-interacting serine/threonine-protein kinase 1 (MKNK1) (T344D) MAP kinase-interacting serine/threonine-protein kinase 1 (MNK1a) [T344D] MKNK1 MKNK1_HUMAN MNK1a
Type:
Protein
Mol. Mass.:
47416.00
Organism:
Homo sapiens (Human)
Description:
Q9BUB5-2 with T344D
Residue:
424
  
Inhibitor
Name:
BDBM176783
Synonyms:
US9675612, 26 4-{7-[(6-Methoxy-1H-indazol-5-yl)amino][1,3]thiazolo[5,4-d]pyrimidin-2-yl}-N, N-dimethylbutanamide
Type:
Small organic molecule
Emp. Form.:
C19H21N7O2S
Mol. Mass.:
411.481
SMILES:
COc1cc2[nH]ncc2cc1Nc1ncnc2sc(CCCC(=O)N(C)C)nc12
: