Target
Acetylcholinesterase
Ligand
BDBM9424
Substrate
BDBM8959
Meas. Tech.
Enzyme Inhibition Assay
IC50
24000±n/a nM
Citation
 Sugimoto, HTsuchiya, YSugumi, HHigurashi, KKaribe, NIimura, YSasaki, AKawakami, YNakamura, TAraki, S Novel piperidine derivatives. Synthesis and anti-acetylcholinesterase activity of 1-benzyl-4-[2-(N-benzoylamino)ethyl]piperidine derivatives. J Med Chem 33:1880-7 (1990)  
Target
Name:
Acetylcholinesterase
Synonyms:
ACES_MOUSE Acetylcholinesterase (mouse AChE) Ache
Type:
Enzyme
Mol. Mass.:
68165.65
Organism:
Mus musculus (mouse)
Description:
Residue:
614
  
Inhibitor
Name:
BDBM9424
Synonyms:
N-{2-[1-(adamantan-1-ylmethyl)piperidin-4-yl]ethyl}-N-methylbenzamide hydrochloride | Piperidine Derivative 36
Type:
Small organic molecule
Emp. Form.:
C26H38N2O
Mol. Mass.:
394.5927
SMILES:
CN(CCC1CCN(CC23CC4CC(CC(C4)C2)C3)CC1)C(=O)c1ccccc1
:
Substrate
Name:
BDBM8959
Synonyms:
(2-Mercaptoethyl)trimethylammonium iodide acetate Acetylthiocholine acetylthiocholine chloride | acetylthiocholine iodide
Type:
Small organic molecule
Emp. Form.:
C7H16NOS
Mol. Mass.:
162.272
SMILES:
CC(=O)SCC[N+](C)(C)C
: