Target
Acetylcholinesterase
Ligand
BDBM9442
Substrate
BDBM8959
Meas. Tech.
Enzyme Inhibition Assay
IC50
38.7±n/a nM
Citation
 Carlier, PRChow, ESHan, YLiu, JEl Yazal, JPang, YP Heterodimeric tacrine-based acetylcholinesterase inhibitors: investigating ligand-peripheral site interactions. J Med Chem 42:4225-31 (1999)  
Target
Name:
Acetylcholinesterase
Synonyms:
ACES_RAT Acetylcholinesterase and butyrylcholinesterase (AChE and BChE) Acetylcholinesterase, AChE | Ache
Type:
Enzyme
Mol. Mass.:
68193.62
Organism:
Rattus norvegicus (rat)
Description:
P37136
Residue:
614
  
Inhibitor
Name:
BDBM9442
Synonyms:
CHEMBL1082739 N-4-Quinolyl-N-9-(1,2,3,4-tetrahydroacridinyl)-1,9-diaminononane Bis-hydrochloride | N-[9-(1,2,3,4-tetrahydroacridin-9-ylamino)nonyl]quinolin-4-amine dihydrochloride
Type:
Small organic molecule
Emp. Form.:
C31H38N4
Mol. Mass.:
466.6602
SMILES:
C(CCCCNc1ccnc2ccccc12)CCCCNc1c2CCCCc2nc2ccccc12
:
Substrate
Name:
BDBM8959
Synonyms:
(2-Mercaptoethyl)trimethylammonium iodide acetate Acetylthiocholine acetylthiocholine chloride | acetylthiocholine iodide
Type:
Small organic molecule
Emp. Form.:
C7H16NOS
Mol. Mass.:
162.272
SMILES:
CC(=O)SCC[N+](C)(C)C
: