Target
Vascular endothelial growth factor receptor 2
Ligand
BDBM4851
Substrate
poly-Glu-Ala-Tyr
Meas. Tech.
Homogeneous Time-resolved Fluorescence (HTRF) Assay
pH
7.5±n/a
Temperature
295.15±n/a K
IC50
54±6 nM
Citation
 Kiselyov, ASPiatnitski, ESemenova, MSemenov, VV N-(Aryl)-4-(azolylethyl)thiazole-5-carboxamides: novel potent inhibitors of VEGF receptors I and II. Bioorg Med Chem Lett 16:602-6 (2006)  
Target
Name:
Vascular endothelial growth factor receptor 2
Synonyms:
CD_antigen=CD309 Fetal liver kinase 1 (FLK-1) KDR Protein-tyrosine kinase receptor Flk-1 VEGFR-2 VEGFR2 Vascular Endothelial Growth Factor Receptor Kinase 2 Vascular endothelial growth factor receptor 2 (KDR) Vascular endothelial growth factor receptor 2 (VEGFR2) Vascular endothelial growth factor receptor-2 (VEGFR-2)
Type:
Receptor Tyrosine Kinase
Mol. Mass.:
151510.97
Organism:
Homo sapiens (Human)
Description:
P35968
Residue:
1356
  
Inhibitor
Name:
BDBM4851
Synonyms:
(4-chlorophenyl)-[4-(4-pyridylmethyl)phthalazin-1-yl]amine CGP 79787 CHEMBL75232 N-(4-chlorophenyl)-4-(pyridin-4-ylmethyl)phthalazin-1-amine PTK787 cid_151194
Type:
Small organic molecule
Emp. Form.:
C20H15ClN4
Mol. Mass.:
346.813
SMILES:
Clc1ccc(Nc2nnc(Cc3ccncc3)c3ccccc23)cc1
:
Substrate
Name:
poly-Glu-Ala-Tyr
Synonyms:
poly-Glu-Ala-Tyr-biotin
Type:
Random Copolymer
Mol. Mass.:
358.43
Organism:
Description:
It is a synthetic polymer of glutamic acid, alanine and tyrosine (poly-Glu-Ala-Tyr) that has been biotinylated.
Residue:
3
NA