Target
Vascular endothelial growth factor receptor 2
Ligand
BDBM9514
Substrate
poly-Glu-Ala-Tyr
Meas. Tech.
Homogeneous Time-resolved Fluorescence (HTRF) Assay
IC50
2120±n/a nM
Citation
 Kiselyov, ASPiatnitski, ESemenova, MSemenov, VV N-(Aryl)-4-(azolylethyl)thiazole-5-carboxamides: novel potent inhibitors of VEGF receptors I and II. Bioorg Med Chem Lett 16:602-6 (2006)  
Target
Name:
Vascular endothelial growth factor receptor 2
Synonyms:
CD_antigen=CD309 Fetal liver kinase 1 (FLK-1) KDR Protein-tyrosine kinase receptor Flk-1 VEGFR-2 VEGFR2 Vascular Endothelial Growth Factor Receptor Kinase 2 Vascular endothelial growth factor receptor 2 (KDR) Vascular endothelial growth factor receptor 2 (VEGFR2) Vascular endothelial growth factor receptor-2 (VEGFR-2)
Type:
Receptor Tyrosine Kinase
Mol. Mass.:
151510.97
Organism:
Homo sapiens (Human)
Description:
P35968
Residue:
1356
  
Inhibitor
Name:
BDBM9514
Synonyms:
N-(Aryl)-thiazole-5-carboxamide 26 | N-[4-chloro-3-(trifluoromethyl)phenyl]-4-[2-(1,2-oxazol-4-yl)ethyl]-1,3-thiazole-5-carboxamide
Type:
Small organic molecule
Emp. Form.:
C16H11ClF3N3O2S
Mol. Mass.:
401.791
SMILES:
FC(F)(F)c1cc(NC(=O)c2scnc2CCc2cnoc2)ccc1Cl
:
Substrate
Name:
poly-Glu-Ala-Tyr
Synonyms:
poly-Glu-Ala-Tyr-biotin
Type:
Random Copolymer
Mol. Mass.:
358.43
Organism:
Description:
It is a synthetic polymer of glutamic acid, alanine and tyrosine (poly-Glu-Ala-Tyr) that has been biotinylated.
Residue:
3
NA