Target
Proto-oncogene tyrosine-protein kinase receptor Ret
Ligand
BDBM311711
Substrate
Meas. Tech.
Measurement of Inhibitory Activity Against RET (In Vitro)
IC50
0.300±n/a nM
Citation
 Miyazaki, IShimamura, TKato, MFujita, HIguchi, S Fused pyrimidine compound or salt thereof US Patent  US10155768 Publication Date 12/18/2018 
Target
Name:
Proto-oncogene tyrosine-protein kinase receptor Ret
Synonyms:
CDHF12 Cadherin family member 12 Proto-oncogene c-Ret RET51 Tyrosine-protein kinase Ret (RET)
Type:
Protein
Mol. Mass.:
124318.29
Organism:
Homo sapiens (Human)
Description:
P07949
Residue:
1114
  
Inhibitor
Name:
BDBM311711
Synonyms:
Ex. Cpd. 163 US11046696, Compound 163
Type:
Small organic molecule
Emp. Form.:
C28H30N6O2
Mol. Mass.:
482.5768
SMILES:
COCc1ccc(NC(=O)c2c(C#CC(C)(C)n3cccc3)n(c3ncnc(N)c23)C2(C)CC2)cc1
: