Target
Bromodomain-containing protein 3 [326-398]
Ligand
BDBM50092341
Substrate
Meas. Tech.
FP Competitive Binding Assay (No.350)
Temperature
298.15±n/a K
Ki
4.20±0.40 nM
Comments
extracted
Citation
 Wang, SRan, XZhao, YYang, CLiu, LBai, LMcEachern, DStuckey, JMeagher, JLSun, DLi, XZhou, BKaratas, HLuo, RChinnaiyan, AAsangani, IA BET bromodomain inhibitors and therapeutic methods using the same US Patent  US9675697 Publication Date 6/13/2017 
Target
Name:
Bromodomain-containing protein 3 [326-398]
Synonyms:
BRD3 Bromodomain-containing protein 3 (BRD3)(BD2) KIAA0043 | RING3L
Type:
Mol. Mass.:
8553.07
Organism:
Homo sapiens (Human)
Description:
BD2 (326-398 aa) of Q15059
Residue:
73
  
Inhibitor
Name:
BDBM50092341
Synonyms:
CHEMBL3581660 | US9675697, Cpd. No. 22
Type:
Small organic molecule
Emp. Form.:
C24H25N5O2
Mol. Mass.:
415.4876
SMILES:
CCc1n[nH]c(CC)c1-c1nccc2[nH]c3cc(-c4c(C)noc4C)c(OC)cc3c12
: