Target
Bromodomain-containing protein 3 [326-398]
Ligand
BDBM179481
Substrate
Meas. Tech.
FP Competitive Binding Assay (No.350)
Temperature
298.15±n/a K
Ki
2.60±n/a nM
Comments
extracted
Citation
 Wang, SRan, XZhao, YYang, CLiu, LBai, LMcEachern, DStuckey, JMeagher, JLSun, DLi, XZhou, BKaratas, HLuo, RChinnaiyan, AAsangani, IA BET bromodomain inhibitors and therapeutic methods using the same US Patent  US9675697 Publication Date 6/13/2017 
Target
Name:
Bromodomain-containing protein 3 [326-398]
Synonyms:
BRD3 Bromodomain-containing protein 3 (BRD3)(BD2) KIAA0043 | RING3L
Type:
Mol. Mass.:
8553.07
Organism:
Homo sapiens (Human)
Description:
BD2 (326-398 aa) of Q15059
Residue:
73
  
Inhibitor
Name:
BDBM179481
Synonyms:
US9675697, Cpd. No. 73
Type:
Small organic molecule
Emp. Form.:
C26H21N5O2
Mol. Mass.:
435.4772
SMILES:
COc1cc2c(cc1-c1c(C)noc1C)[nH]c1nc(C)nc(-c3ccnc4ccccc34)c21
: