Target
Sigma intracellular receptor 2
Ligand
BDBM50353847
Substrate
Meas. Tech.
Receptor Assay
Ki
0.210±0.020 nM
Citation
 McCurdy, CRMesangeau, CChin, FTJames, MLShen, BGambhir, S Highly selective sigma receptor radioligands US Patent  US9604926 Publication Date 3/28/2017 
Target
Name:
Sigma intracellular receptor 2
Synonyms:
S2r Sigma-2 receptor Tmem97 | Transmembrane protein 97
Type:
Mol. Mass.:
20818.69
Organism:
Mus musculus (Mouse)
Description:
Q8VD00
Residue:
176
  
Inhibitor
Name:
BDBM50353847
Synonyms:
CHEMBL1831157 US9724435, Compound CM-360
Type:
Small organic molecule
Emp. Form.:
C23H28N2O2
Mol. Mass.:
364.4806
SMILES:
COc1cc2CCN(CCCCn3ccc4ccccc34)Cc2cc1OC
: