Target
Lysine-specific histone demethylase 1A
Ligand
BDBM50445349
Substrate
Meas. Tech.
LSD1 Assay
pH
7.4±n/a
Temperature
298.15±n/a K
Ki
50±n/a nM
Comments
extracted
Citation
 Fyfe, MCOrtega Muñoz, ACastro-Palomino Laria, JMartinell Pedemonte, MEstiarte-Martinez, MValls Vidal, N Cyclopropylamine derivatives useful as LSD1 inhibitors US Patent  US9676701 Publication Date 6/13/2017 
Target
Name:
Lysine-specific histone demethylase 1A
Synonyms:
AOF2 Flavin-containing amine oxidase domain-containing protein 2 KDM1A KIAA0601 Lysine-specific demethylase 1 (LSD1) Lysine-specific histone demethylase 1 (LSD1)
Type:
Enzyme
Mol. Mass.:
92901.01
Organism:
Homo sapiens (Human)
Description:
O60341
Residue:
852
  
Inhibitor
Name:
BDBM50445349
Synonyms:
CHEMBL3104261 | US9676701, 63 Enantiomers of 4′-((trans)-2-aminocyclopropyl)biphenyl-3-ol hydrochloride
Type:
Small organic molecule
Emp. Form.:
C15H15NO
Mol. Mass.:
225.2857
SMILES:
N[C@@H]1C[C@H]1c1ccc(cc1)-c1cccc(O)c1
: