Target
Genome polyprotein
Ligand
BDBM9939
Substrate
NS3-NS4A Chromogenic Peptide Substrate
Meas. Tech.
Continuous Spectrophotometric Assay
pH
6.5±n/a
Temperature
303.15±n/a K
Ki
50±n/a nM
Citation
 Bogen, SLRuan, SLiu, RAgrawal, SPichardo, JProngay, ABaroudy, BSaksena, AKGirijavallabhan, VNjoroge, FG Depeptidization efforts on P3-P2' alpha-ketoamide inhibitors of HCV NS3-4A serine protease: effect on HCV replicon activity. Bioorg Med Chem Lett 16:1621-7 (2006)  
Target
Name:
Genome polyprotein
Synonyms:
Dipeptidyl peptidase 4 (DPP4) NS3 NS5B NS3-4A Protease NS3/4A protease POLG_HCV77 | RNA polymerase (NS5B)
Type:
Protease Domain
Mol. Mass.:
327221.49
Organism:
Hepatitis C virus (HCV genotype 1a, isolate H)
Description:
P27958
Residue:
3011
  
Inhibitor
Name:
BDBM9939
Synonyms:
2-methylpropyl N-[(S)-cyclohexyl({[(1S)-2-cyclopropyl-1-({3-cyclopropyl-1-[({[(S)-(dimethylcarbamoyl)(phenyl)methyl]carbamoyl}methyl)carbamoyl]-1-oxopropan-2-yl}carbamoyl)ethyl]carbamoyl})methyl]carbamate | depeptidized alpha-ketoamide inhibitor 35
Type:
Small organic molecule
Emp. Form.:
C38H56N6O8
Mol. Mass.:
724.8866
SMILES:
CC(C)COC(=O)N[C@@H](C1CCCCC1)C(=O)N[C@@H](CC1CC1)C(=O)NC(CC1CC1)C(=O)C(=O)NCC(=O)N[C@H](C(=O)N(C)C)c1ccccc1
:
Substrate
Name:
NS3-NS4A Chromogenic Peptide Substrate
Synonyms:
Type:
Peptide
Mol. Mass.:
1366.94
Organism:
Description:
The 4-phenylazophenol (PAP) chromophore was incorporated to improve assay sensitivity.
Residue:
13
ACDTEDVVPNVAH