Target
Aromatase
Ligand
BDBM9947
Substrate
BDBM8592
Meas. Tech.
Aromatase Assay
pH
7.5±n/a
Temperature
310.15±n/a K
Ki
43±n/a nM
IC50
520±n/a nM
Citation
 Numazawa, MOshibe, MYamaguchi, STachibana, M Time-dependent inactivation of aromatase by 6-alkylandrosta-1,4-diene-3,17-diones. Effects of length and configuration of 6-alkyl group. J Med Chem 39:1033-8 (1996)  
Target
Name:
Aromatase
Synonyms:
ARO1 CP19A_HUMAN CYP19 CYPXIX Cytochrome P450 19A1 Cytochrome P450-C19 (CYP19) FL cytokine receptor precursor | P-450AROM
Type:
Enzyme
Mol. Mass.:
57888.92
Organism:
Homo sapiens (Human)
Description:
P11511
Residue:
503
  
Inhibitor
Name:
BDBM9947
Synonyms:
(8R)-2,8,15-trimethyltetracyclo[8.7.0.0^{2,7}.0^{11,15}]heptadeca-3,6-diene-5,14-dione | 6-Alkyl 1,4-Diene Steroid 4a
Type:
Small organic molecule
Emp. Form.:
C20H26O2
Mol. Mass.:
298.4192
SMILES:
C[C@@H]1CC2C3CCC(=O)C3(C)CCC2C2(C)C=CC(=O)C=C12
:
Substrate
Name:
BDBM8592
Synonyms:
(2R,15S)-2,15-dimethyltetracyclo[8.7.0.0^{2,7}.0^{11,15}]heptadec-6-ene-5,14-dione Androst-4-ene-3,17-dione [1beta-3H] androstenedione
Type:
Small organic molecule
Emp. Form.:
C19H26O2
Mol. Mass.:
286.4085
SMILES:
C[C@]12CCC3C(CCC4=CC(=O)CC[C@]34C)C1CCC2=O
: