Target
Aromatase
Ligand
BDBM10001
Substrate
BDBM8592
Meas. Tech.
Aromatase Assay
pH
7.4±n/a
Temperature
310.15±n/a K
IC50
49±n/a nM
Citation
 Saberi, MRVinh, TKYee, SWGriffiths, BJEvans, PJSimons, C Potent CYP19 (aromatase) 1-[(benzofuran-2-yl)(phenylmethyl)pyridine, -imidazole, and -triazole inhibitors: synthesis and biological evaluation. J Med Chem 49:1016-22 (2006)  
Target
Name:
Aromatase
Synonyms:
ARO1 CP19A_HUMAN CYP19 CYPXIX Cytochrome P450 19A1 Cytochrome P450-C19 (CYP19) FL cytokine receptor precursor | P-450AROM
Type:
Enzyme
Mol. Mass.:
57888.92
Organism:
Homo sapiens (Human)
Description:
P11511
Residue:
503
  
Inhibitor
Name:
BDBM10001
Synonyms:
(4-chlorophenyl)(6-methoxy-1-benzofuran-2-yl)pyridin-3-ylmethanol Benzofuran Pyridine Derivative 4b
Type:
Small organic molecule
Emp. Form.:
C21H16ClNO3
Mol. Mass.:
365.81
SMILES:
COc1ccc2cc(oc2c1)C(O)(c1ccc(Cl)cc1)c1cccnc1
:
Substrate
Name:
BDBM8592
Synonyms:
(2R,15S)-2,15-dimethyltetracyclo[8.7.0.0^{2,7}.0^{11,15}]heptadec-6-ene-5,14-dione Androst-4-ene-3,17-dione [1beta-3H] androstenedione
Type:
Small organic molecule
Emp. Form.:
C19H26O2
Mol. Mass.:
286.4085
SMILES:
C[C@]12CCC3C(CCC4=CC(=O)CC[C@]34C)C1CCC2=O
: