Target
Caspase-3
Ligand
BDBM10280
Substrate
Caspase-3 Substrate
Meas. Tech.
Caspase Inhibition Assay
IC50
68±n/a nM
Citation
 Chen, YHZhang, YHZhang, HJLiu, DZGu, MLi, JYWu, FZhu, XZLi, JNan, FJ Design, synthesis, and biological evaluation of isoquinoline-1,3,4-trione derivatives as potent caspase-3 inhibitors. J Med Chem 49:1613-23 (2006)  
Target
Name:
Caspase-3
Synonyms:
Apopain CASP3 CPP-32 Caspase 3 Caspase-3 subunit p17 SCA-1 Yama protein | caspase-3 preproprotein
Type:
Hydrolase; heterotetramer of two heterodimers
Mol. Mass.:
31607.55
Organism:
Homo sapiens (Human)
Description:
Residue:
277
  
Inhibitor
Name:
BDBM10280
Synonyms:
3-[(1,3,4-trioxo-1,2,3,4-tetrahydroisoquinolin-6-yl)carbamoyl]propanoic acid N-(1,3,4-Trioxo-1,2,3,4-tetrahydro-isoquinolin-6-yl)-succinamic acid
Type:
Small organic molecule
Emp. Form.:
C13H10N2O6
Mol. Mass.:
290.2283
SMILES:
OC(=O)CCC(=O)Nc1ccc2C(=O)NC(=O)C(=O)c2c1
:
Substrate
Name:
Caspase-3 Substrate
Synonyms:
Caspase-3 Substrate (Chromogenic)
Type:
Mol. Mass.:
1438.65
Organism:
Description:
pNA=p-Nitroaniline
Residue:
16
ACASPGLVALASPPNA