Target
Caspase-3
Ligand
BDBM10289
Substrate
Caspase-3 Substrate
Meas. Tech.
Caspase Inhibition Assay
IC50
148±n/a nM
Citation
 Chen, YHZhang, YHZhang, HJLiu, DZGu, MLi, JYWu, FZhu, XZLi, JNan, FJ Design, synthesis, and biological evaluation of isoquinoline-1,3,4-trione derivatives as potent caspase-3 inhibitors. J Med Chem 49:1613-23 (2006)  
Target
Name:
Caspase-3
Synonyms:
Apopain CASP3 CPP-32 Caspase 3 Caspase-3 subunit p17 SCA-1 Yama protein | caspase-3 preproprotein
Type:
Hydrolase; heterotetramer of two heterodimers
Mol. Mass.:
31607.55
Organism:
Homo sapiens (Human)
Description:
Residue:
277
  
Inhibitor
Name:
BDBM10289
Synonyms:
Isoquinoline-1,3,4-trione 13h N-(3-methoxyphenyl)-N'-(1,3,4-trioxo-1,2,3,4-tetrahydroisoquinolin-6-yl)butanediamide
Type:
Small organic molecule
Emp. Form.:
C20H17N3O6
Mol. Mass.:
395.3655
SMILES:
COc1cccc(NC(=O)CCC(=O)Nc2ccc3C(=O)NC(=O)C(=O)c3c2)c1
:
Substrate
Name:
Caspase-3 Substrate
Synonyms:
Caspase-3 Substrate (Chromogenic)
Type:
Mol. Mass.:
1438.65
Organism:
Description:
pNA=p-Nitroaniline
Residue:
16
ACASPGLVALASPPNA