Target
Caspase-3
Ligand
BDBM10296
Substrate
Caspase-3 Substrate
Meas. Tech.
Caspase Inhibition Assay
IC50
384±n/a nM
Citation
 Chen, YHZhang, YHZhang, HJLiu, DZGu, MLi, JYWu, FZhu, XZLi, JNan, FJ Design, synthesis, and biological evaluation of isoquinoline-1,3,4-trione derivatives as potent caspase-3 inhibitors. J Med Chem 49:1613-23 (2006)  
Target
Name:
Caspase-3
Synonyms:
Apopain CASP3 CPP-32 Caspase 3 Caspase-3 subunit p17 SCA-1 Yama protein | caspase-3 preproprotein
Type:
Hydrolase; heterotetramer of two heterodimers
Mol. Mass.:
31607.55
Organism:
Homo sapiens (Human)
Description:
Residue:
277
  
Inhibitor
Name:
BDBM10296
Synonyms:
2-Chloro-N-(1,3,4-trioxo-1,2,3,4-tetrahydro-isoquinolin-7-yl)-benzamide Isoquinoline-1,3,4-trione 14d
Type:
Small organic molecule
Emp. Form.:
C16H9ClN2O4
Mol. Mass.:
328.707
SMILES:
Clc1ccccc1C(=O)Nc1ccc2C(=O)C(=O)NC(=O)c2c1
:
Substrate
Name:
Caspase-3 Substrate
Synonyms:
Caspase-3 Substrate (Chromogenic)
Type:
Mol. Mass.:
1438.65
Organism:
Description:
pNA=p-Nitroaniline
Residue:
16
ACASPGLVALASPPNA