Target
Caspase-2
Ligand
BDBM10284
Substrate
Caspase Substrate
Meas. Tech.
Caspase Inhibition Assay
IC50
231±n/a nM
Citation
 Chen, YHZhang, YHZhang, HJLiu, DZGu, MLi, JYWu, FZhu, XZLi, JNan, FJ Design, synthesis, and biological evaluation of isoquinoline-1,3,4-trione derivatives as potent caspase-3 inhibitors. J Med Chem 49:1613-23 (2006)  
Target
Name:
Caspase-2
Synonyms:
CASP-2 CASP2_HUMAN Caspase-2 subunit p13 ICH-1 protease ICH1 NEDD2 | Neural precursor cell expressed developmentally down-regulated protein 2
Type:
Enzyme
Mol. Mass.:
50688.29
Organism:
Homo sapiens (Human)
Description:
P42575
Residue:
452
  
Inhibitor
Name:
BDBM10284
Synonyms:
4-Oxo-4-piperidin-1-yl-N-(1,3,4-trioxo-1,2,3,4-tetrahydro-isoquinolin-6-yl)-butyramide Isoquinoline-1,3,4-trione 13c
Type:
Small organic molecule
Emp. Form.:
C18H19N3O5
Mol. Mass.:
357.3606
SMILES:
O=C(CCC(=O)N1CCCCC1)Nc1ccc2C(=O)NC(=O)C(=O)c2c1
:
Substrate
Name:
Caspase Substrate
Synonyms:
Type:
Mol. Mass.:
358.43
Organism:
Description:
Residue:
3
NA