Target
Caspase-8
Ligand
BDBM10264
Substrate
Caspase Substrate
Meas. Tech.
Caspase Inhibition Assay
IC50
425±n/a nM
Citation
 Chen, YHZhang, YHZhang, HJLiu, DZGu, MLi, JYWu, FZhu, XZLi, JNan, FJ Design, synthesis, and biological evaluation of isoquinoline-1,3,4-trione derivatives as potent caspase-3 inhibitors. J Med Chem 49:1613-23 (2006)  
Target
Name:
Caspase-8
Synonyms:
Apoptotic cysteine protease CAP4 CASP8 Caspase Caspase-8 subunit p18 FADD-like ICE ICE-like apoptotic protease 5 MCH5 | MORT1-associated CED-3 homolog
Type:
Enzyme
Mol. Mass.:
55373.89
Organism:
Homo sapiens (Human)
Description:
Q14790
Residue:
479
  
Inhibitor
Name:
BDBM10264
Synonyms:
2-oxo-1-phenyl-2-[(1,3,4-trioxo-1,2,3,4-tetrahydroisoquinolin-5-yl)amino]ethyl acetate phenyl[(1,3,4-trioxo-1,2,3,4-tetrahydroisoquinolin-5-yl)carbamoyl]methyl acetate
Type:
Small organic molecule
Emp. Form.:
C19H14N2O6
Mol. Mass.:
366.3243
SMILES:
CC(=O)OC(C(=O)Nc1cccc2C(=O)NC(=O)C(=O)c12)c1ccccc1
:
Substrate
Name:
Caspase Substrate
Synonyms:
Type:
Mol. Mass.:
358.43
Organism:
Description:
Residue:
3
NA