Target
RAF proto-oncogene serine/threonine-protein kinase
Ligand
BDBM313645
Substrate
Meas. Tech.
In Vitro Raf Activity Determination
IC50
20.0±n/a nM
Citation
 Aversa, RJBurger, MTDillon, MPDineen, Jr., TALou, YNishiguchi, GARamurthy, SRico, ACRauniyar, VSendzik, MSubramanian, SSetti, LQTaft, BRTanner, HRWan, L Compounds and compositions as RAF kinase inhibitors US Patent  US10167279 Publication Date 1/1/2019 
Target
Name:
RAF proto-oncogene serine/threonine-protein kinase
Synonyms:
C-Raf Protein Kinase RAF RAF1 Raf-1 Serine/threonine-protein kinase C-Raf | cRaf
Type:
Serine/threonine-protein kinase
Mol. Mass.:
73082.52
Organism:
Homo sapiens (Human)
Description:
P04049
Residue:
648
  
Inhibitor
Name:
BDBM313645
Synonyms:
N-(3-(2-(2- hydroxyethoxy)-6- (tetrahydro-2H-pyran-4- yl)pyridin-4-yl)-4- methylphenyl)-6- (trifluoromethyl) pyridazine-4- carboxamide | US10167279, Example 271
Type:
Small organic molecule
Emp. Form.:
C25H25F3N4O4
Mol. Mass.:
502.4856
SMILES:
Cc1ccc(NC(=O)c2cnnc(c2)C(F)(F)F)cc1-c1cc(OCCO)nc(c1)C1CCOCC1
: