Target
Acetylcholinesterase
Ligand
BDBM10405
Substrate
BDBM8959
Meas. Tech.
Enzyme Inhibition Assay
pH
8±n/a
Temperature
295.15±n/a K
IC50
38±2 nM
Citation
 Greenblatt, HMGuillou, CGuenard, DArgaman, ABotti, SBadet, BThal, CSilman, ISussman, JL The complex of a bivalent derivative of galanthamine with torpedo acetylcholinesterase displays drastic deformation of the active-site gorge: implications for structure-based drug design. J Am Chem Soc 126:15405-11 (2004)  
Target
Name:
Acetylcholinesterase
Synonyms:
3.1.1.7 Acetylcholinesterase (AChE) ache
Type:
Mol. Mass.:
65900.74
Organism:
Tetronarce californica (Pacific electric ray) (Torpedo californica)
Description:
P04058
Residue:
586
  
Inhibitor
Name:
BDBM10405
Synonyms:
2-{8-[(1S,12S,14R)-14-hydroxy-9-methoxy-11-oxa-4-azatetracyclo[8.6.1.0^{1,12}.0^{6,17}]heptadeca-6,8,10(17),15-tetraen-4-yl]octyl}-2,3-dihydro-1H-isoindole-1,3-dione galanthamine deriv. 3d
Type:
Small organic molecule
Emp. Form.:
C32H38N2O5
Mol. Mass.:
530.6545
SMILES:
COc1ccc2CN(CCCCCCCCN3C(=O)c4ccccc4C3=O)CC[C@@]34C=C[C@H](O)C[C@@H]3Oc1c24
:
Substrate
Name:
BDBM8959
Synonyms:
(2-Mercaptoethyl)trimethylammonium iodide acetate Acetylthiocholine acetylthiocholine chloride | acetylthiocholine iodide
Type:
Small organic molecule
Emp. Form.:
C7H16NOS
Mol. Mass.:
162.272
SMILES:
CC(=O)SCC[N+](C)(C)C
: