Target
Acetylcholinesterase
Ligand
BDBM10432
Substrate
BDBM8959
Meas. Tech.
Enzyme Inhibition Assay
IC50
9700±n/a nM
Citation
 Mary, ARenko, DZGuillou, CThal, C Potent acetylcholinesterase inhibitors: design, synthesis, and structure-activity relationships of bis-interacting ligands in the galanthamine series. Bioorg Med Chem 6:1835-50 (1998)  
Target
Name:
Acetylcholinesterase
Synonyms:
3.1.1.7 Acetylcholinesterase (AChE) ache
Type:
Mol. Mass.:
65900.74
Organism:
Tetronarce californica (Pacific electric ray) (Torpedo californica)
Description:
P04058
Residue:
586
  
Inhibitor
Name:
BDBM10432
Synonyms:
(8-{[(1S,12S,14R)-14-hydroxy-4-methyl-11-oxa-4-azatetracyclo[8.6.1.0^{1,12}.0^{6,17}]heptadeca-6(17),7,9,15-tetraen-9-yl]oxy}octyl)trimethylazanium bromide galanthamine deriv. 9d
Type:
Small organic molecule
Emp. Form.:
C27H43N2O3
Mol. Mass.:
443.6414
SMILES:
CN1CC[C@@]23C=C[C@H](O)C[C@@H]2Oc2c3c(C1)ccc2OCCCCCCCC[N+](C)(C)C
:
Substrate
Name:
BDBM8959
Synonyms:
(2-Mercaptoethyl)trimethylammonium iodide acetate Acetylthiocholine acetylthiocholine chloride | acetylthiocholine iodide
Type:
Small organic molecule
Emp. Form.:
C7H16NOS
Mol. Mass.:
162.272
SMILES:
CC(=O)SCC[N+](C)(C)C
: