Target
Acetylcholinesterase
Ligand
BDBM10446
Substrate
BDBM8959
Meas. Tech.
Enzyme Inhibition Assay
pH
7.4±n/a
Temperature
310.15±n/a K
IC50
54.1±2.0 nM
Citation
 Han, YFLi, CPChow, EWang, HPang, YPCarlier, PR Dual-site binding of bivalent 4-aminopyridine- and 4-aminoquinoline-based AChE inhibitors: contribution of the hydrophobic alkylene tether to monomer and dimer affinities. Bioorg Med Chem 7:2569-75 (1999)  
Target
Name:
Acetylcholinesterase
Synonyms:
ACES_RAT Acetylcholinesterase and butyrylcholinesterase (AChE and BChE) Acetylcholinesterase, AChE | Ache
Type:
Enzyme
Mol. Mass.:
68193.62
Organism:
Rattus norvegicus (rat)
Description:
P37136
Residue:
614
  
Inhibitor
Name:
BDBM10446
Synonyms:
2-methyl-N-{9-[(2-methylquinolin-4-yl)amino]nonyl}quinolin-4-amine dihydrochloride N,N-di-4-Quinaldinyl-1,9-diaminononane bis-hydrochloride
Type:
Small organic molecule
Emp. Form.:
C29H36N4
Mol. Mass.:
440.6229
SMILES:
Cc1cc(NCCCCCCCCCNc2cc(C)nc3ccccc23)c2ccccc2n1
:
Substrate
Name:
BDBM8959
Synonyms:
(2-Mercaptoethyl)trimethylammonium iodide acetate Acetylthiocholine acetylthiocholine chloride | acetylthiocholine iodide
Type:
Small organic molecule
Emp. Form.:
C7H16NOS
Mol. Mass.:
162.272
SMILES:
CC(=O)SCC[N+](C)(C)C
: