Target
Acetylcholinesterase
Ligand
BDBM10469
Substrate
BDBM8959
Meas. Tech.
Enzyme Inhibition Assay
pH
7.4±n/a
Temperature
310.15±n/a K
IC50
0.77±0.11 nM
Citation
 Pang, YPQuiram, PJelacic, THong, FBrimijoin, S Highly potent, selective, and low cost bis-tetrahydroaminacrine inhibitors of acetylcholinesterase. Steps toward novel drugs for treating Alzheimer's disease. J Biol Chem 271:23646-9 (1996)  
Target
Name:
Acetylcholinesterase
Synonyms:
ACES_RAT Acetylcholinesterase and butyrylcholinesterase (AChE and BChE) Acetylcholinesterase, AChE | Ache
Type:
Enzyme
Mol. Mass.:
68193.62
Organism:
Rattus norvegicus (rat)
Description:
P37136
Residue:
614
  
Inhibitor
Name:
BDBM10469
Synonyms:
Bis-THA inhibitor 1c CHEMBL424707 | N-[9-(1,2,3,4-tetrahydroacridin-9-ylamino)nonyl]-1,2,3,4-tetrahydroacridin-9-amine
Type:
Small organic molecule
Emp. Form.:
C35H44N4
Mol. Mass.:
520.7507
SMILES:
C(CCCCNc1c2CCCCc2nc2ccccc12)CCCCNc1c2CCCCc2nc2ccccc12
:
Substrate
Name:
BDBM8959
Synonyms:
(2-Mercaptoethyl)trimethylammonium iodide acetate Acetylthiocholine acetylthiocholine chloride | acetylthiocholine iodide
Type:
Small organic molecule
Emp. Form.:
C7H16NOS
Mol. Mass.:
162.272
SMILES:
CC(=O)SCC[N+](C)(C)C
: