Target
Acetylcholinesterase
Ligand
BDBM10470
Substrate
BDBM8959
Meas. Tech.
Enzyme Inhibition Assay
pH
7.4±n/a
Temperature
310.15±n/a K
IC50
40±6 nM
Citation
 Carlier, PRHan, YFChow, ESLi, CPWang, HLieu, TXWong, HSPang, YP Evaluation of short-tether bis-THA AChE inhibitors. A further test of the dual binding site hypothesis. Bioorg Med Chem 7:351-7 (1999)  
Target
Name:
Acetylcholinesterase
Synonyms:
ACES_RAT Acetylcholinesterase and butyrylcholinesterase (AChE and BChE) Acetylcholinesterase, AChE | Ache
Type:
Enzyme
Mol. Mass.:
68193.62
Organism:
Rattus norvegicus (rat)
Description:
P37136
Residue:
614
  
Inhibitor
Name:
BDBM10470
Synonyms:
Bis-THA inhibitor 1d CHEMBL386423 | N-[10-(1,2,3,4-tetrahydroacridin-9-ylamino)decyl]-1,2,3,4-tetrahydroacridin-9-amine
Type:
Small organic molecule
Emp. Form.:
C36H46N4
Mol. Mass.:
534.7772
SMILES:
C(CCCCCNc1c2CCCCc2nc2ccccc12)CCCCNc1c2CCCCc2nc2ccccc12
:
Substrate
Name:
BDBM8959
Synonyms:
(2-Mercaptoethyl)trimethylammonium iodide acetate Acetylthiocholine acetylthiocholine chloride | acetylthiocholine iodide
Type:
Small organic molecule
Emp. Form.:
C7H16NOS
Mol. Mass.:
162.272
SMILES:
CC(=O)SCC[N+](C)(C)C
: